{"text_format":"1","workbook":"xlsx","n_sheets":7,"sheets":["Instructions","Entry Sheet","Bill Print","Calculation sheet","Goswara","Annual Report","Montly Dakk"],"not_rendered":{"charts":0,"images":0,"macros":1,"external_links":1,"defined_names":4,"comments":1,"pivot_tables":0},"unopened":[],"bounds":{"document_bytes":16777216,"sheet_cells":100000,"rows_first":2000,"rows_last":500,"rows_between":2000,"halvings":0,"cell_chars":16384,"cell_head_chars":4096},"cells_cut":0,"cells_raw":0,"read":"whole","date_system":"1900"}

{"sheet":"Instructions","index":0,"n_rows":10,"n_cols":1,"rows_kept":10,"cut":false,"hidden":false,"merged":[]}
["Instructions"]
["Kindly read All Instructions before Use Report Card Utitly"]
["1. To Fill All Required Data Use  Entry Sheet "]
["2. Fill Data only In Yellow Cell."]
["3. Select Month , Year And Day on Which Kheer is prepared for students"]
["4. in Entry Sheet Enter Date wise No. of Students to whom Served Meal (Yellow Cells). Left Cell Blank On Holidays "]
["5. Now Goto Bill Print Sheet To Print Bill. There are two option First Auto Bill - No Need To do any think just take print or Make pdfSecond is Custom Bill - Where you can Fill Custom rate of items. I Custom Bill you have to Match Bill Amount with Montly cost "]
["6. Calculation Sheet is Just to Show Daily And Mothly Consumtion of Various Items Used in MDM"]
["7. If any Query/Suggestion Please Email Us at abhi072011@gmail.com"]
["8. Visit Website for More Tools  WWW.TeachersHelp.in"]

{"sheet":"Entry Sheet","index":1,"n_rows":66,"n_cols":21,"rows_kept":66,"cut":false,"hidden":false,"merged":[[34,0,35,0],[34,1,35,1],[4,7,4,8],[2,14,2,16],[4,14,4,15],[6,14,6,15],[32,0,33,0],[32,1,33,1],[2,7,2,8],[2,11,2,13],[4,11,4,12],[6,11,6,12],[6,7,6,8],[36,0,37,0],[36,1,37,1],[38,0,39,0],[38,1,39,1],[0,14,0,15],[12,0,12,1],[8,3,8,13],[0,7,0,13],[0,0,0,6],[7,7,7,8],[9,3,9,11],[11,4,11,7],[11,11,11,12],[2,1,2,5],[4,1,4,5],[6,1,6,5]]}
["ਮਿਡ-ਡੇ-ਮੀਲ kYlkulytr (A`pr pRwiemrI)",null,null,null,null,null,null,"ਇਸ ਐਂਟਰੀ ਸ਼ੀਟ ਦੇ ਪੀਲੇ ਖਾਨਿਆਂ ਵਿੱਚ twiep kਰੋ ਅਤੇ ਬਾਕੀ ਸ਼ੀਟਸ ਦੇ ਪ੍ਰਿੰਟ ਪ੍ਰਾਪਤ ਕਰੋ",null,null,null,null,null,null,"Cooking Cost Per Student",null,10.17]
[]
["ਸਕੂਲ    :","srkwrI hweI skUl ",null,null,null,null,null,"ਮਹੀਨਾ:",null,"Jun",null,"Anwj dw ਮੁਢਲਾ ਬਕਾਇਆ",null,null,"ies mhIny pRwpq Anwj"]
[]
["blwk   :","KMnw",null,null,null,null,null,"ਸਾਲ:",null,2026,null,"kxk (ਕਿਲੋਗ੍ਰਾਮ):",null,100,"kxk (ਕਿਲੋਗ੍ਰਾਮ):",null,0]
[]
["ਜਿਲ੍ਹਾ    :","luiDAwxw",null,null,null,null,null,"ਖੀਰ ਬਣਾਉਣ ਵਾਲਾ ਦਿਨ :",null,"Tue",null,"cwvl  (ਕਿਲੋਗ੍ਰਾਮ):",null,200,"cwvl (ਕਿਲੋਗ੍ਰਾਮ):",null,0]
[null,null,null,null,null,null,null,"PrUt dyx dw idn :",null,"Fri"]
[null,null,null,"imf-fy-mIl sbMDI Anwj dw stwk Aqy Kpq rijstr ( jmwq 6 qo 8)",null,null,null,null,null,null,null,null,null,null,null,"Total Working Day",{"$f":"COUNTIF(H15:H45,\">0\")","v":0}]
[null,null,null,{"$f":"B3&\"   \"&\" blwk \"&\"  \"&B5&\" \"&\"  ijlHw  \"& \"  \"&B7 & \" \"","v":"srkwrI hweI skUl     blwk   KMnw   ijlHw    luiDAwxw "},null,null,null,null,null,null,null,null,{"$f":"J3","v":"Jun"},{"$f":"J5","v":2026},null,null,null,null,null,"Satrt Date",{"$f":"DATEVALUE(1&J3&J5)","v":"2026-06-01"}]
[]
[null,null,null,"imqI","Bojn Kwx vwly ividAwrQI",null,null,null,"kxk","cwvl","shI"," mYbrW vlO nrIKx",null,"irmwks",null,null,null,null,null,"End Date",{"$f":"EOMONTH(U10,0)","v":"2026-06-30"}]
["mhIny dorwn AOsqn dwKl ividAwrQI \ndI igxqI:-",null,null,null,6,7,8,"ku`l","K`pq 150 gRwm pRiq ivid","K`pq 150 gRwm pRiq ivid.",null,"nW","hsqwKr"]
[null,null,null,null,"hwjr","hwjr","hwjr","hwjr","iklo ivc","iklo iv`c",null,null,null,null,null,null,null,{"$f":"SUM(H15:H21)","v":0},null,null,"Jan"]
["mhIny dy surU ivc muFlw bkwieAw",null,null,{"$f":"U10","v":"2026-06-01"},null,null,null,{"$f":"SUM(E15:G15)","v":0},{"$f":"'Calculation sheet'!L7","v":0},{"$f":"'Calculation sheet'!M7","v":0},null,null,null,null,null,null,null,{"$f":"SUM(H22:H28)","v":0},{"$f":"IF(ISBLANK((D15)),\"None\",TEXT(D15,\"DDD\"))","v":"Mon"},"Mon","Feb"]
{"$rows_left_out":52}
{"sheet":"Bill Print","index":2,"n_rows":45,"n_cols":19,"rows_kept":45,"cut":false,"hidden":false,"merged":[[24,18,25,18],[27,13,27,18],[31,13,31,18],[36,12,36,19],[0,1,0,8],[1,1,35,1],[1,8,35,8],[36,1,36,8],[0,12,0,19],[1,12,35,12],[1,13,1,18],[1,19,35,19],[2,13,2,16],[3,13,3,18],[18,14,18,16],[19,13,19,18],[24,16,25,16],[24,17,25,17],[31,2,31,7],[3,2,3,7],[27,2,27,7],[26,3,26,5],[26,14,26,16],[1,2,1,7],[19,2,19,7],[24,5,25,5],[24,6,25,6],[24,7,25,7],[11,6,14,6],[11,7,14,7],[18,3,18,5],[2,4,2,5],[2,2,2,3]]}
[]
[null,null,"Monthly Bill Item Wise Auto",null,null,null,null,null,null,null,null,null,null,"Monthly Bill Custom Rate Wise"]
[null,null,null,null,"For the Month of: ",null,null,{"$f":"'Entry Sheet'!J3&+\"_\"&'Entry Sheet'!J5","v":"Jun_2026"},null,null,null,null,null,"For the Month of: ",null,null,null,{"$f":"H3","v":"Jun_2026"},{"$f":"'Entry Sheet'!U3&+\"_\"&'Entry Sheet'!U5","v":"_"}]
[null,null,"kirAwnw ib`l",null,null,null,null,null,null,null,null,null,null,"kirAwnw ib`l"]
[null,null,"Sr. no.","Item","Quantity","Rate","Total","Total Amount",null,null,null,null,null,"Sr. no.","Item","Quantity","Rate","Total","Total Amount"]
[null,null,1,"dwl (cnw Aqy muMgI)",{"$f":"'Calculation sheet'!$Z$38","v":0},110,{"$f":"E6*F6","v":0},{"$f":"G6","v":0},null,null,null,null,null,1,"dwl (cnw Aqy muMgI)",{"$f":"'Calculation sheet'!$Z$38","v":0},110,{"$f":"P6*Q6","v":0},{"$f":"R6","v":0}]
[null,null,2,"kwly Coly",{"$f":"'Calculation sheet'!$AA$38","v":0},90,{"$f":"E7*F7","v":0},{"$f":"G7","v":0},null,null,null,null,null,2,"kwly Coly",{"$f":"'Calculation sheet'!$AA$38","v":0},90,{"$f":"P7*Q7","v":0},{"$f":"R7","v":0}]
[null,null,3,"bysx",{"$f":"'Calculation sheet'!$AD$38","v":0},105,0,0,null,null,null,null,null,3,"bysx",{"$f":"'Calculation sheet'!$AD$38","v":0},105,0,0]
[null,null,4,"irPwief qyl",{"$f":"'Calculation sheet'!$AG$38","v":0},140,0,0,null,null,null,null,null,4,"irPwief qyl",{"$f":"'Calculation sheet'!$AG$38","v":0},130,0,0]
[null,null,5,"cInI",{"$f":"'Calculation sheet'!$AH$38","v":0},45,0,0,null,null,null,null,null,5,"cInI",{"$f":"'Calculation sheet'!$AH$38","v":0},44,0,0]
[null,null,6,"rwjmwh",{"$f":"'Calculation sheet'!$AK$38","v":0},95,0,0,null,null,null,null,null,6,"rwjmwh",{"$f":"'Calculation sheet'!$AK$38","v":0},95,0,0]
[null,null,7,"nmk",null,null,{"$f":"ROUND(SUM(G6:G11)/7,0)","v":0},{"$f":"G12","v":0},null,null,null,null,null,7,"nmk",null,100,{"$f":"Q12","v":100},{"$f":"R12","v":100}]
[null,null,8,"hldI",null,null,null,null,null,null,null,null,null,8,"hldI",null,120,{"$f":"Q13","v":120},{"$f":"R13","v":120}]
[null,null,9,"imrc",null,null,null,null,null,null,null,null,null,9,"imrc",null,60,60,60]
[null,null,10,"mswlw",null,null,null,null,null,null,null,null,null,10,"mswlw",null,60,60,{"$f":"R15","v":60}]
{"$rows_left_out":31}
{"sheet":"Calculation sheet","index":3,"n_rows":40,"n_cols":43,"rows_kept":40,"cut":false,"hidden":false,"merged":[[1,0,1,19],[2,0,4,0],[2,1,4,1],[2,2,4,2],[2,3,4,3],[2,4,4,4],[2,5,2,8],[2,9,3,10],[2,19,4,19],[38,7,38,10],[4,40,4,42],[2,25,2,38],[5,0,5,1],[2,15,3,16],[2,17,4,17],[2,18,4,18],[3,5,3,6],[3,7,3,8],[2,11,3,12],[2,13,3,14]]}
[]
[{"$f":"\"rojwnw Anwj dI Kpq Aqy pkwaux dy Krcy dI irport\"&\n\"   skUl dw nwm: = \"& 'Entry Sheet'!D10","v":"rojwnw Anwj dI Kpq Aqy pkwaux dy Krcy dI irport   skUl dw nwm: = srkwrI hweI skUl     blwk   KMnw   ijlHw    luiDAwxw "}]
["lVI nM","imqI","dwKl hoey ividAwrQIAw dI igxqI","hwjLr ividAwrQIAw dI igxqI","Bojn krn vwly ividAwrQIAw dI igxqI","skUl ivwc Anwj dw BMzwr",null,null,null,"ku`l BMfwr",null,"A`j dy idn dI Anwj dI vrqoN",null,"ies mhIny dI Anwj dI vrqoN pROgRYisv",null,"Anwj dw bkwieAw BMzwr",null,"A`j dy idn dw Bojn bxwaux dw Krcw","ies mhIny dw pOgRYisv Bojn pkwaux dw Krcw","Bojn dI iksm",null,null,null,null,null,"Bojn bnwaux leI dUsrI smgrI (iklo iv`c)"]
[null,null,null,null,null,"muuFlw bkwieAw",null,"A`j dy idn dI pRwpqI"]
[null,null,null,null,null,"kxk \niklo ivwc","cwvl iklo iv`c","kxk \nik`lo iv`c","cwvl iklo iv`c","kxk \nik`lo iv`c","cwvl iklo iv`c","kxk \nik`lo iv`c","cwvl iklo iv`c","kxk \nik`lo ivwc","cwvl iklo iv`c","kxk \nik`lo ivwc","cwvl iklo iv`c",null,null,null,null,{"$f":"'Entry Sheet'!J7","v":"Tue"},null,null,null,"Dal","Black Channa","Onion ","Curd","Besan","Vegetables","Vegitable for Dal","Oil & Fat","Sugar","Milk","Pattato","Rajmah","Fruits",null,null,"pRqI b`cw rwSn dI imkdwr"]
["Previous\n",null,null,null,0,{"$f":"'Entry Sheet'!A17","v":100},{"$f":"'Entry Sheet'!B17","v":200},{"$f":"'Entry Sheet'!A20","v":0},{"$f":"'Entry Sheet'!B20","v":0},null,null,null,null,null,null,null,null,null,null,null,null,null,null,null,null,"In KG","In KG","In KG","In KG","In KG","In KG","In KG","In KG","In KG","In Litt","In KG","In kg","pcs",null,null,"Item","Quantity /Std in gm","In KG"]
[1,{"$f":"'Entry Sheet'!D15","v":"2026-06-01"},null,{"$f":"'Entry Sheet'!H15","v":0},{"$f":"D7","v":0},{"$f":"F6","v":100},{"$f":"G6","v":200},0,0,{"$f":"F7+H6","v":100},{"$f":"G7+I6","v":200},{"$f":"IF(OR(X7=\"MonOK\",X7=\"WedOK\",X7=\"FriOK\"),E7*0.15,IF(OR(X7=\"MonOK Aqy Kir\",X7=\"WedOK Aqy Kir\",X7=\"FriOK Aqy Kir\"),E7*0.135,0))","v":0},{"$f":"IF(OR(X7=\"TueOK\",X7=\"ThuOK\",X7=\"SatOK\"),E7*0.15,IF(OR(X7=\"MonOK Aqy Kir\",X7=\"WedOK Aqy Kir\",X7=\"FriOK Aqy Kir\"),E7*0.015,IF(OR(X7=\"TueOK Aqy Kir\",X7=\"ThuOK Aqy Kir\",X7=\"SatOK Aqy Kir\"),E7*0.15,0)))","v":0},{"$f":"N6+L7","v":0},0,{"$f":"J7-L7","v":100},{"$f":"K7-M7","v":200},{"$f":"E7*'Entry Sheet'!$Q$1","v":0},{"$f":"S6+R7","v":0},{"$f":"CHOOSE(Y7,\"dwl (mOsmI sbjI imlw ky) Aqy rotI\",\"rwjmwh Aqy  cwvl\",\"kwly Colyy(AwlU imlw ky)Aqy rotI \",\"kVI (pkOoiVAW smyq) Aqy cwvl\",\"moOsmI sbjI Aqy rotI\",\"dwl (mOsmI sbjI imlw ky) Aqy cwvl \",\"dwl (mOsmI sbjI imlw ky) Aqy rotI Aqy KIr\",\"rwjmwh Aqy  cwvl Aqy KIr\",\"kwly Colyy(AwlU imlw ky)Aqy rotI Aqy KIr\",\"kVI (pkOoiVAW smyq) Aqy cwvl Aqy KIr\",\"moOsmI sbjI Aqy rotI Aqy KIr\",\"dwl (mOsmI sbjI imlw ky) Aqy cwvl Aqy KIr\",\"Cu`tI\",\"Cu`tI\")","v":"Cu`tI"},{"$f":"IF(AND(W7=\"Wed\",E7>0),\"kwly Colyy(AwlU imlw ky)Aqy rotI \",IF(AND(W7=\"Thu\",E7>0),\"kVI (pkOoiVAW smyq) Aqy cwvl\",IF(AND(W7=\"Mon\",E7>0),\"dwl (mOsmI sbjI imlw ky) Aqy rotI\",IF(AND(W7=\"Tue\",E7>0),\"rwjmwh Aqy  cwvl\",IF(AND(W7=\"Fri\",E7>0),\"moOsmI sbjI Aqy rotI\",IF(AND(W7=\"Sat\",E7>0),\"dwl (mOsmI sbjI imlw ky) Aqy cwvl \",\"Cu`tI\"))))))","v":"Cu`tI"},{"$f":"IF(AND(E7>0,$V$5=W7),\" Aqy KIr\",\"\")","v":""},{"$f":"'Entry Sheet'!S15","v":"Mon"},{"$f":"IF(E7>0,W7&\"OK\"&V7,\"\")","v":""},{"$f":"IF(X7=\"MonOk\",1,IF(X7=\"TueOk\",2,IF(X7=\"WedOk\",3,IF(X7=\"ThuOk\",4,IF(X7=\"FriOk\",5,IF(X7=\"SatOk\",6,IF(X7=\"MonOk Aqy KIr\",7,IF(X7=\"TueOk Aqy KIr\",8,IF(X7=\"WedOk Aqy KIr\",9,IF(X7=\"ThuOk Aqy KIr\",10,IF(X7=\"FriOk Aqy KIr\",11,IF(X7=\"SatOk Aqy KIr\",12,IF(W7=\"Sun\",13,14)))))))))))))","v":14},{"$f":"IF(OR(Y7=1,Y7=6,Y7=7,Y7=12),E7*$AQ$7,0)","v":0},{"$f":"IF(OR(Y7=3,Y7=9),E7*$AQ$8,0)","v":0},{"$f":"IF(OR(Y7=1,Y7=6,Y7=7,Y7=12,Y7=2,Y7=8),E7*$AQ$21,IF(OR(Y7=3,Y7=9),E7*$AQ$22,IF(OR(Y7=4,Y7=10),E7*$AQ$23,IF(OR(Y7=5,Y7=11),E7*$AQ$24,0))))","v":0},{"$f":"IF(OR(Y7=4,Y7=10),E7*$AQ$19,0)","v":0},{"$f":"IF(OR(Y7=4,Y7=10),E7*$AQ$10,0)","v":0},{"$f":"IF(OR(Y7=5,Y7=11),E7*$AQ$28,0)","v":0},{"$f":"IF(OR(Y7=1,Y7=6,Y7=7,Y7=12),E7*$AQ$27,0)","v":0},{"$f":"IF(OR(Y7=1,Y7=6,Y7=7,Y7=12,Y7=2,Y7=8),E7*$AQ$11,IF(OR(Y7=3,Y7=9),E7*$AQ$12,IF(OR(Y7=4,Y7=10),E7*$AQ$13,IF(OR(Y7=5,Y7=11),E7*$AQ$14,0))))","v":0},{"$f":"IF(OR(Y7=7,Y7=8,Y7=9,Y7=10,Y7=11,Y7=12),E7*$AQ$18,0)","v":0},{"$f":"IF(OR(Y7=7,Y7=8,Y7=9,Y7=10,Y7=11,Y7=12),E7*$AQ$20,0)","v":0},{"$f":"IF(OR(Y7=4,Y7=10),E7*$AQ$25,IF(OR(Y7=3,Y7=9),E7*$AQ$26,0))","v":0},{"$f":"IF(OR(Y7=2,Y7=8),E7*$AQ$9,0)","v":0},{"$f":"IF('Entry Sheet'!$J$8='Calculation sheet'!W7,E7,0)","v":0},null,null,"dwl",30,{"$f":"AP7/1000","v":0.03}]
[2,{"$f":"'Entry Sheet'!D16","v":"2026-06-02"},null,{"$f":"'Entry Sheet'!H16","v":0},{"$f":"D8","v":0},{"$f":"P7","v":100},{"$f":"Q7","v":200},0,0,{"$f":"F8+H8","v":100},{"$f":"G8+I8","v":200},{"$f":"IF(OR(X8=\"MonOK\",X8=\"WedOK\",X8=\"FriOK\"),E8*0.15,IF(OR(X8=\"MonOK Aqy Kir\",X8=\"WedOK Aqy Kir\",X8=\"FriOK Aqy Kir\"),E8*0.135,0))","v":0},{"$f":"IF(OR(X8=\"TueOK\",X8=\"ThuOK\",X8=\"SatOK\"),E8*0.15,IF(OR(X8=\"MonOK Aqy Kir\",X8=\"WedOK Aqy Kir\",X8=\"FriOK Aqy Kir\"),E8*0.015,IF(OR(X8=\"TueOK Aqy Kir\",X8=\"ThuOK Aqy Kir\",X8=\"SatOK Aqy Kir\"),E8*0.15,0)))","v":0},0,0,{"$f":"J8-L8","v":100},{"$f":"K8-M8","v":200},{"$f":"E8*'Entry Sheet'!$Q$1","v":0},{"$f":"S7+R8","v":0},{"$f":"CHOOSE(Y8,\"dwl (mOsmI sbjI imlw ky) Aqy rotI\",\"rwjmwh Aqy  cwvl\",\"kwly Colyy(AwlU imlw ky)Aqy rotI \",\"kVI (pkOoiVAW smyq) Aqy cwvl\",\"moOsmI sbjI Aqy rotI\",\"dwl (mOsmI sbjI imlw ky) Aqy cwvl \",\"dwl (mOsmI sbjI imlw ky) Aqy rotI Aqy KIr\",\"rwjmwh Aqy  cwvl Aqy KIr\",\"kwly Colyy(AwlU imlw ky)Aqy rotI Aqy KIr\",\"kVI (pkOoiVAW smyq) Aqy cwvl Aqy KIr\",\"moOsmI sbjI Aqy rotI Aqy KIr\",\"dwl (mOsmI sbjI imlw ky) Aqy cwvl Aqy KIr\",\"Cu`tI\",\"Cu`tI\")","v":"Cu`tI"},{"$f":"IF(AND(W8=\"Wed\",E8>0),\"kwly Colyy(AwlU imlw ky)Aqy rotI \",IF(AND(W8=\"Thu\",E8>0),\"kVI (pkOoiVAW smyq) Aqy cwvl\",IF(AND(W8=\"Mon\",E8>0),\"dwl (mOsmI sbjI imlw ky) Aqy rotI\",IF(AND(W8=\"Tue\",E8>0),\"rwjmwh Aqy  cwvl\",IF(AND(W8=\"Fri\",E8>0),\"moOsmI sbjI Aqy rotI\",IF(AND(W8=\"Sat\",E8>0),\"dwl (mOsmI sbjI imlw ky) Aqy cwvl \",\"Cu`tI\"))))))","v":"Cu`tI"},{"$f":"IF(AND(E8>0,$V$5=W8),\" Aqy KIr\",\"\")","v":""},{"$f":"'Entry Sheet'!S16","v":"Tue"},{"$f":"IF(E8>0,W8&\"OK\"&V8,\"\")","v":""},14,{"$f":"IF(OR(Y8=1,Y8=6,Y8=7,Y8=12),E8*$AQ$7,0)","v":0},{"$f":"IF(OR(Y8=3,Y8=9),E8*$AQ$8,0)","v":0},{"$f":"IF(OR(Y8=1,Y8=6,Y8=7,Y8=12,Y8=2,Y8=8),E8*$AQ$21,IF(OR(Y8=3,Y8=9),E8*$AQ$22,IF(OR(Y8=4,Y8=10),E8*$AQ$23,IF(OR(Y8=5,Y8=11),E8*$AQ$24,0))))","v":0},{"$f":"IF(OR(Y8=4,Y8=10),E8*$AQ$19,0)","v":0},{"$f":"IF(OR(Y8=4,Y8=10),E8*$AQ$10,0)","v":0},{"$f":"IF(OR(Y8=5,Y8=11),E8*$AQ$28,0)","v":0},{"$f":"IF(OR(Y8=1,Y8=6,Y8=7,Y8=12),E8*$AQ$27,0)","v":0},{"$f":"IF(OR(Y8=1,Y8=6,Y8=7,Y8=12,Y8=2,Y8=8),E8*$AQ$11,IF(OR(Y8=3,Y8=9),E8*$AQ$12,IF(OR(Y8=4,Y8=10),E8*$AQ$13,IF(OR(Y8=5,Y8=11),E8*$AQ$14,0))))","v":0},{"$f":"IF(OR(Y8=7,Y8=8,Y8=9,Y8=10,Y8=11,Y8=12),E8*$AQ$18,0)","v":0},{"$f":"IF(OR(Y8=7,Y8=8,Y8=9,Y8=10,Y8=11,Y8=12),E8*$AQ$20,0)","v":0},{"$f":"IF(OR(Y8=4,Y8=10),E8*$AQ$25,IF(OR(Y8=3,Y8=9),E8*$AQ$26,0))","v":0},{"$f":"IF(OR(Y8=2,Y8=8),E8*$AQ$9,0)","v":0},{"$f":"IF('Entry Sheet'!$J$8='Calculation sheet'!W8,E8,0)","v":0},null,null,"Coly",35,{"$f":"AP8/1000","v":3.5000000000000003E-2}]
[3,{"$f":"'Entry Sheet'!D17","v":"2026-06-03"},null,{"$f":"'Entry Sheet'!H17","v":0},0,{"$f":"P8","v":100},{"$f":"Q8","v":200},0,0,{"$f":"F9+H9","v":100},{"$f":"G9+I9","v":200},0,0,0,0,{"$f":"J9-L9","v":100},{"$f":"K9-M9","v":200},{"$f":"E9*'Entry Sheet'!$Q$1","v":0},{"$f":"S8+R9","v":0},"Cu`tI","Cu`tI","",{"$f":"'Entry Sheet'!S17","v":"Wed"},"",14,0,0,0,0,0,0,0,0,0,0,0,0,{"$f":"IF('Entry Sheet'!$J$8='Calculation sheet'!W9,E9,0)","v":0},null,null,"rwj mwh",30,0.03]
[4,{"$f":"'Entry Sheet'!D18","v":"2026-06-04"},null,{"$f":"'Entry Sheet'!H18","v":0},0,100,200,0,0,100,200,0,0,{"$f":"N9+L10","v":0},{"$f":"O9+M10","v":0},100,200,{"$f":"E10*'Entry Sheet'!$Q$1","v":0},0,"Cu`tI","Cu`tI","",{"$f":"'Entry Sheet'!S18","v":"Thu"},"",14,0,0,0,0,0,0,0,0,0,0,0,0,{"$f":"IF('Entry Sheet'!$J$8='Calculation sheet'!W10,E10,0)","v":0},null,null,"bysx",30,0.03]
[5,{"$f":"'Entry Sheet'!D19","v":"2026-06-05"},null,{"$f":"'Entry Sheet'!H19","v":0},0,100,200,0,0,100,200,0,0,{"$f":"N10+L11","v":0},0,{"$f":"J11-L11","v":100},200,{"$f":"E11*'Entry Sheet'!$Q$1","v":0},0,"Cu`tI","Cu`tI",{"$f":"IF(AND(E11>0,$V$5=W11),\" Aqy KIr\",\"\")","v":""},{"$f":"'Entry Sheet'!S19","v":"Fri"},"",14,0,0,0,0,0,0,0,0,0,0,0,0,{"$f":"IF('Entry Sheet'!$J$8='Calculation sheet'!W11,E11,0)","v":0},null,null,"irPwief dwl/rwjmwh",10,0.01]
[6,{"$f":"'Entry Sheet'!D20","v":"2026-06-06"},null,{"$f":"'Entry Sheet'!H20","v":0},0,100,200,0,0,100,200,0,0,0,0,100,200,{"$f":"E12*'Entry Sheet'!$Q$1","v":0},0,"Cu`tI","Cu`tI","",{"$f":"'Entry Sheet'!S20","v":"Sat"},"",14,0,0,0,0,0,0,0,0,0,0,0,0,{"$f":"IF('Entry Sheet'!$J$8='Calculation sheet'!W12,E12,0)","v":0},null,null,"irPwief CoilAw nwl",15.5,1.55E-2]
[7,{"$f":"'Entry Sheet'!D21","v":"2026-06-07"},null,{"$f":"'Entry Sheet'!H21","v":0},0,100,200,0,0,100,200,0,0,0,0,100,200,{"$f":"E13*'Entry Sheet'!$Q$1","v":0},0,"Cu`tI","Cu`tI","",{"$f":"'Entry Sheet'!S21","v":"Sun"},"",13,0,0,0,0,0,0,0,0,0,0,0,0,{"$f":"IF('Entry Sheet'!$J$8='Calculation sheet'!W13,E13,0)","v":0},null,null,"irPwief kVI nwl",7.5,7.4999999999999997E-3]
[8,{"$f":"'Entry Sheet'!D22","v":"2026-06-08"},null,{"$f":"'Entry Sheet'!H22","v":0},0,100,200,0,0,100,200,0,0,0,0,100,200,{"$f":"E14*'Entry Sheet'!$Q$1","v":0},0,"Cu`tI","Cu`tI","",{"$f":"'Entry Sheet'!S22","v":"Mon"},"",14,0,0,0,0,0,0,0,0,0,0,0,0,{"$f":"IF('Entry Sheet'!$J$8='Calculation sheet'!W14,E14,0)","v":0},null,null,"irPwief mosmI sbjI",9,8.9999999999999993E-3]
[9,{"$f":"'Entry Sheet'!D23","v":"2026-06-09"},null,{"$f":"'Entry Sheet'!H23","v":0},0,100,200,0,0,100,200,0,0,0,0,100,200,{"$f":"E15*'Entry Sheet'!$Q$1","v":0},0,"Cu`tI","Cu`tI","",{"$f":"'Entry Sheet'!S23","v":"Tue"},"",14,0,0,0,0,0,0,0,0,0,0,0,0,{"$f":"IF('Entry Sheet'!$J$8='Calculation sheet'!W15,E15,0)","v":0},null,null,"nmk",15,1.4999999999999999E-2]
{"$rows_left_out":26}
{"sheet":"Goswara","index":4,"n_rows":37,"n_cols":7,"rows_kept":37,"cut":false,"hidden":false,"merged":[[0,0,0,5],[4,4,4,6],[4,0,4,3],[3,4,3,5],[1,0,1,6],[2,0,2,6]]}
["kYS bu`k qy mwhvwrI (Abstract)gosvwrw (jmwq 6vI qo 8vI)"]
[{"$f":"'Entry Sheet'!B3&\" blwk \"&'Entry Sheet'!B5","v":"srkwrI hweI skUl  blwk KMnw"}]
[]
[null,null,null,"mhInw  :",{"$f":"'Entry Sheet'!J3&\" - \"&'Entry Sheet'!J5","v":"Jun - 2026"}]
["kuikMg kwst dI pRpqI (ru ivc)",null,null,null,"Krcy dw vyrvw"]
["imqI","muFlw bkwieAw","pRwpqI","ku`l joV",1,"Bojn krn vwly ku`l ividAwrQIAW dI igxqI",{"$f":"'Entry Sheet'!H46","v":0}]
[1,{"$f":"'Entry Sheet'!B37","v":0},{"$f":"'Entry Sheet'!B33","v":0},{"$f":"B7+C7-'Calculation sheet'!S7","v":0},2,"skUl ivc vrikMg idnW dI igxqI",{"$f":"'Entry Sheet'!Q9","v":0}]
[2,null,null,{"$f":"D7-'Calculation sheet'!R8","v":0},3,{"$f":"\"mwhvwrI rupey \"& 'Entry Sheet'!Q1  & \" pRqI b`cw pRqI idn nwl ku`l Krcw\"","v":"mwhvwrI rupey 10.17 pRqI b`cw pRqI idn nwl ku`l Krcw"},{"$f":"'Entry Sheet'!B32","v":0}]
[3,null,null,{"$f":"D8-'Calculation sheet'!R9","v":0}]
[4,null,null,{"$f":"D9-'Calculation sheet'!R10","v":0},4,"kuikMg kwst dI ku`l rkm",{"$f":"B7+C7","v":0}]
[5,null,null,{"$f":"D10-'Calculation sheet'!R11","v":0},5,"mhIny dy AMq qy kuikMg kwst dI bkwieAW rkm",{"$f":"G10-G8","v":0}]
[6,null,null,{"$f":"D11-'Calculation sheet'!R12","v":0},null,"(kwlm 4-3)"]
[7,null,null,{"$f":"D12-'Calculation sheet'!R13","v":0}]
[8,null,null,{"$f":"D13-'Calculation sheet'!R14","v":0}]
[9,null,null,{"$f":"D14-'Calculation sheet'!R15","v":0},null,"kuikMg kwst dI bkwieAw rkm",{"$f":"B7","v":0}]
{"$rows_left_out":23}
{"sheet":"Annual Report","index":5,"n_rows":618,"n_cols":18,"rows_kept":618,"cut":false,"hidden":false,"merged":[[1,15,2,15],[1,16,2,16],[1,17,2,17],[1,14,2,14],[0,0,0,14],[1,1,1,2],[1,3,1,4],[1,5,1,6],[1,7,1,8],[1,9,2,9],[1,10,2,10],[1,11,2,11],[1,12,2,12],[1,13,2,13]]}
["Month Wise Record"]
[null,"Opening Balance",null,"Receiving This Month",null,"Consumption (in Kg)",null,"Balance at End",null,"Total Students","Cookng Cost of All Std.","Fund Allocate at PFMS This Month","Fund Utilize AS PFMS (in RS.)","Balance Fund in PFMS","Fund Surplus/Short As Total Cost ","Total Pieces Fruit  Given","Amount of Food","Woking Days"]
["Month &Year","Wheat","Rice","Wheat","Rice","Wheat","Rice","Wheet","Rice"]
["2024-09-01",0,0,0,0,0,0,{"$f":"(B4+D4)-F4","v":0},{"$f":"(C4+E4)-G4","v":0},0,0,null,null,{"$f":"L4-M4","v":0},{"$f":"L4-K4","v":0}]
["2025-01-01",100,200,0,0,165,180,{"$f":"(B5+D5)-F5","v":-65},20,2300,21366.999999999996,10000,20000,{"$f":"L5-M5","v":-10000},{"$f":"L5-K5","v":-11366.999999999996}]
[null,null,null,null,null,null,null,0,0,null,null,null,null,0,0]
[null,null,null,null,null,null,null,0,0,null,null,null,null,0,0]
[null,null,null,null,null,null,null,0,0,null,null,null,null,0,0]
[null,null,null,null,null,null,null,0,0,null,null,null,null,0,0]
[null,null,null,null,null,null,null,0,0,null,null,null,null,0,0]
[null,null,null,null,null,null,null,0,0,null,null,null,null,0,0]
[null,null,null,null,null,null,null,0,0,null,null,null,null,0,0]
[null,null,null,null,null,null,null,0,0,null,null,null,null,0,0]
[null,null,null,null,null,null,null,0,0,null,null,null,null,0,0]
[null,null,null,null,null,null,null,0,0,null,null,null,null,0,0]
{"$rows_left_out":604}
{"sheet":"Montly Dakk","index":6,"n_rows":30,"n_cols":10,"rows_kept":30,"cut":false,"hidden":false,"merged":[[2,0,2,3],[2,5,2,8],[3,0,3,3],[3,5,3,8],[6,1,6,2],[6,3,6,4],[6,5,6,6],[6,7,6,8],[7,1,7,2],[7,3,7,4],[7,5,7,6],[7,7,7,8],[8,1,8,2],[8,3,8,4],[8,5,8,6],[8,7,8,8],[9,1,9,2],[9,3,9,4],[9,5,9,6],[9,7,9,8],[10,1,10,2],[10,3,10,4],[10,5,10,6],[10,7,10,8],[13,1,13,2],[13,3,13,4],[13,5,13,6],[13,7,13,8],[14,5,14,6],[14,7,14,8],[17,1,17,2],[17,3,17,4],[17,5,17,6],[17,7,17,8],[22,0,22,8],[23,0,23,8],[24,0,24,8],[25,0,25,8],[0,6,0,8],[0,1,0,5],[18,1,18,2],[18,3,18,4],[18,5,18,6],[18,7,18,8],[19,1,19,2],[19,3,19,4],[19,5,19,6],[19,7,19,8],[14,1,14,2],[14,3,14,4]]}
["    skUl dw nwm:",{"$f":"'Entry Sheet'!B3:F3","v":"srkwrI hweI skUl "},null,null,null,null,"imf fy mIl irport mhInw",null,null,{"$f":"'Entry Sheet'!J3&\"-\"&'Entry Sheet'!J5","v":"Jun-2026"}]
[]
["kul dwKl ividAwrQI (CyvI qo A~TvI q~k)",null,null,null,0,"mhIny dOrwn skUl l~gx vwly idnW dI igxqI   ",null,null,null,{"$f":"'Entry Sheet'!Q9","v":0}]
["mhIny dOrwn b`icAw nUM id~qy gey ku~l Bojn",null,null,null,{"$f":"'Entry Sheet'!H46","v":0},"mhIny dOrwn imf fy mIL dyx vwly idnW dI igxਤੀ    ",null,null,null,{"$f":"J3","v":0}]
[]
["1) kUikMg kwst Aqy Anwj dw vyrvw:-"]
["vyrvw","mu~Flw bkwieAw",null," mhIny dOrwn pRwpqI",null,"ku`l joV",null,"mhIny dOrwn Kpq",null,"bkwieAw"]
["cwvl",{"$f":"'Entry Sheet'!N7","v":200},null,{"$f":"'Entry Sheet'!Q7","v":0},null,{"$f":"B8+D8","v":200},null,{"$f":"'Entry Sheet'!B26","v":0},null,{"$f":"'Entry Sheet'!B31","v":200}]
["kxk",{"$f":"'Entry Sheet'!N5","v":100},null,{"$f":"'Entry Sheet'!Q5","v":0},null,100,null,{"$f":"'Entry Sheet'!A26","v":0},null,{"$f":"'Entry Sheet'!A31","v":100}]
["kuikMg kwst",{"$f":"'Entry Sheet'!B37","v":0},null,{"$f":"'Entry Sheet'!B33","v":0},null,0,null,{"$f":"'Entry Sheet'!B35","v":0},null,{"$f":"F10-H10","v":0}]
["mosmI Pl",0,null,{"$f":"'Bill Print'!H35","v":0},null,{"$f":"B11+D11","v":0},null,{"$f":"'Bill Print'!H35","v":0},null,{"$f":"F11-H11","v":0}]
[]
[" 2) hPqy vwiej  ijnHW b~icAw nUM Pl Kwx leI id~qw igAw:-"]
["pihly hPqy","dUsry  hPqy ",null,"qIsry hPqy ",null,"coQy  hPqy ",null,"pMjvy hPqy ",null,"jOV"]
[{"$f":"'Entry Sheet'!R14","v":0},{"$f":"'Entry Sheet'!R15","v":0},null,{"$f":"'Entry Sheet'!R16","v":0},null,{"$f":"'Entry Sheet'!R17","v":0},null,{"$f":"'Entry Sheet'!R18","v":0},null,{"$f":"A15+B15+D15+F15+H15","v":0}]
{"$rows_left_out":15}